Target
Histone deacetylase 2
Ligand
BDBM50003616
Substrate
Meas. Tech.
ChEMBL_718469 (CHEMBL1680133)
IC50
62000±n/a nM
Citation
 Fass, DMShah, RGhosh, BHennig, KNorton, SZhao, WNReis, SAKlein, PSMazitschek, RMaglathlin, RLLewis, TAHaggarty, SJ Effect of Inhibiting Histone Deacetylase with Short-Chain Carboxylic Acids and Their Hydroxamic Acid Analogs on Vertebrate Development and Neuronal Chromatin. ACS Med Chem Lett 2:39-42 (2011)  
Target
Name:
Histone deacetylase 2
Synonyms:
Cereblon/Histone deacetylase 2 HDAC2 Histone deacetylase 2 (HDAC2) | Human HDAC2
Type:
Chromatin regulator; hydrolase; repressor
Mol. Mass.:
55356.54
Organism:
Homo sapiens (Human)
Description:
Q92769
Residue:
488
  
Inhibitor
Name:
BDBM50003616
Synonyms:
2-n-propyl-n-valeric acid DPA VALPROIC ACID dipropylacetic acid | n-DPA
Type:
Small organic molecule
Emp. Form.:
C8H16O2
Mol. Mass.:
144.2114
SMILES:
CCCC(CCC)C(O)=O
: