Target
KiSS-1 receptor
Ligand
BDBM26338
Substrate
Meas. Tech.
ChEMBL_718922 (CHEMBL1681416)
IC50
0.710±n/a nM
Citation
 Oishi, SMisu, RTomita, KSetsuda, SMasuda, ROhno, HNaniwa, YIeda, NInoue, NOhkura, SUenoyama, YTsukamura, HMaeda, KHirasawa, ATsujimoto, GFujii, N Activation of Neuropeptide FF Receptors by Kisspeptin Receptor Ligands. ACS Med Chem Lett 2:53-57 (2011)  
Target
Name:
KiSS-1 receptor
Synonyms:
AXOR12 G-protein coupled receptor 54 (GPR54) Hypogonadotropin-1 KISSR_HUMAN Kisspeptins receptor hOT7T175
Type:
G Protein-Coupled Receptor (GPCR)
Mol. Mass.:
42613.79
Organism:
Homo sapiens (Human)
Description:
Binding assay was performed using membranes from the CHO cell transfectants.
Residue:
398
  
Inhibitor
Name:
BDBM26338
Synonyms:
(2S)-N-[(1S)-4-carbamimidamido-1-{[(1S)-1-carbamoyl-2-(1H-indol-3-yl)ethyl]carbamoyl}butyl]-2-{2-[(2S)-2-[(4-fluorophenyl)formamido]-3-phenylpropanamido]acetamido}-4-methylpentanamide N-[(4-fluorophenyl)carbonyl]-L-phenylalanylglycyl-L-leucyl-L-arginyl-L-tryptophanamide | Peptide analogue, 1
Type:
Emp. Form.:
C41H51FN10O6
Mol. Mass.:
798.9054
SMILES:
CC(C)C[C@H](NC(=O)CNC(=O)[C@H](Cc1ccccc1)NC(=O)c1ccc(F)cc1)C(=O)N[C@@H](CCCN=C(N)N)C(=O)N[C@@H](Cc1c[nH]c2ccccc12)C(N)=O
: