Target
Neuropeptide FF receptor 2
Ligand
BDBM26339
Substrate
Meas. Tech.
ChEMBL_718924 (CHEMBL1681418)
IC50
2400±n/a nM
Citation
 Oishi, SMisu, RTomita, KSetsuda, SMasuda, ROhno, HNaniwa, YIeda, NInoue, NOhkura, SUenoyama, YTsukamura, HMaeda, KHirasawa, ATsujimoto, GFujii, N Activation of Neuropeptide FF Receptors by Kisspeptin Receptor Ligands. ACS Med Chem Lett 2:53-57 (2011)  
Target
Name:
Neuropeptide FF receptor 2
Synonyms:
G-protein coupled receptor 74 GPR74 NPFF2_HUMAN NPGPR Neuropeptide G-protein coupled receptor
Type:
Enzyme Catalytic Domain
Mol. Mass.:
60293.78
Organism:
Homo sapiens (Human)
Description:
NPFF2 0 HUMAN::Q9Y5X5
Residue:
522
  
Inhibitor
Name:
BDBM26339
Synonyms:
(2R,3E)-N-[(1S)-4-carbamimidamido-1-{[(1S)-1-carbamoyl-2-(1H-indol-3-yl)ethyl]carbamoyl}butyl]-5-[(2S)-2-[(4-fluorophenyl)formamido]-3-phenylpropanamido]-2-(2-methylpropyl)pent-3-enamide | Peptide analogue, 19
Type:
Emp. Form.:
C42H52FN9O5
Mol. Mass.:
781.918
SMILES:
CC(C)C[C@H](\C=C\CNC(=O)[C@H](Cc1ccccc1)NC(=O)c1ccc(F)cc1)C(=O)N[C@@H](CCCN=C(N)N)C(=O)N[C@@H](Cc1c[nH]c2ccccc12)C(N)=O
: