Target
Steroid 17-alpha-hydroxylase/17,20 lyase
Ligand
BDBM50338362
Substrate
Meas. Tech.
ChEMBL_728149 (CHEMBL1687150)
IC50
14±n/a nM
Citation
 Kaku, TMatsunaga, NOjida, ATanaka, THara, TYamaoka, MKusaka, MTasaka, A 17,20-lyase inhibitors. Part 4: design, synthesis and structure-activity relationships of naphthylmethylimidazole derivatives as novel 17,20-lyase inhibitors. Bioorg Med Chem 19:1751-70 (2011)  
Target
Name:
Steroid 17-alpha-hydroxylase/17,20 lyase
Synonyms:
CP17A_RAT Cyp17a1 Cytochrome P450 17A1 Steroid 17-alpha-hydroxylase/17,20 lyase
Type:
Enzyme
Mol. Mass.:
57255.68
Organism:
Rattus norvegicus (Rat)
Description:
P11715
Residue:
507
  
Inhibitor
Name:
BDBM50338362
Synonyms:
CHEMBL1682888 | rac-1-{6-[1-Hydroxy-1-(1H-imidazol-4-yl)-2-methylpropyl]-2-naphthyl}-1-ethanone
Type:
Small organic molecule
Emp. Form.:
C19H20N2O2
Mol. Mass.:
308.3743
SMILES:
CC(C)C(O)(c1cnc[nH]1)c1ccc2cc(ccc2c1)C(C)=O
: