Target
Adenosine receptor A3
Ligand
BDBM50214981
Substrate
Meas. Tech.
ChEMBL_730137 (CHEMBL1696017)
Ki
1.66±n/a nM
Citation
 Hou, XKim, HOAlexander, VKim, KChoi, SPark, SGLee, JHYoo, LSGao, ZGJacobson, KAJeong, LS Discovery of New Human A(2A) Adenosine Receptor Agonists: Design, Synthesis, and Binding Mode of Truncated 2-Hexynyl-4'-thioadenosine. ACS Med Chem Lett 9:516-520 (2010)  
Target
Name:
Adenosine receptor A3
Synonyms:
A3 adenosine receptor (hA3) ADORA3 | Adenosine A3 receptor (A3AR)
Type:
G Protein-Coupled Receptor (GPCR)
Mol. Mass.:
36197.32
Organism:
Homo sapiens (Human)
Description:
P0DMS8
Residue:
318
  
Inhibitor
Name:
BDBM50214981
Synonyms:
(2R,3R,4S)-2-(2-chloro-6-(3-chlorobenzylamino)-9H-purin-9-yl)tetrahydrothiophene-3,4-diol CHEMBL387921
Type:
Small organic molecule
Emp. Form.:
C16H15Cl2N5O2S
Mol. Mass.:
412.294
SMILES:
O[C@@H]1CS[C@H]([C@@H]1O)n1cnc2c(NCc3cccc(Cl)c3)nc(Cl)nc12
: