Target
Adenosine receptor A2a
Ligand
BDBM50339076
Substrate
Meas. Tech.
ChEMBL_730134 (CHEMBL1696014)
Ki
7.19±n/a nM
Citation
 Hou, XKim, HOAlexander, VKim, KChoi, SPark, SGLee, JHYoo, LSGao, ZGJacobson, KAJeong, LS Discovery of New Human A(2A) Adenosine Receptor Agonists: Design, Synthesis, and Binding Mode of Truncated 2-Hexynyl-4'-thioadenosine. ACS Med Chem Lett 9:516-520 (2010)  
Target
Name:
Adenosine receptor A2a
Synonyms:
A2A adenosine receptor (hA2A) ADENOSINE A2 ADORA2 Adenosine A2A receptor (A2AAR)
Type:
G Protein-Coupled Receptor (GPCR)
Mol. Mass.:
44716.46
Organism:
Homo sapiens (Human)
Description:
P29274
Residue:
412
  
Inhibitor
Name:
BDBM50339076
Synonyms:
(2R,3R,4S)-2-(6-amino-2-(hex-1-ynyl)-9H-purin-9-yl)tetrahydrothiophene-3,4-diol | CHEMBL1688378
Type:
Small organic molecule
Emp. Form.:
C15H19N5O2S
Mol. Mass.:
333.409
SMILES:
CCCCC#Cc1nc(N)c2ncn([C@@H]3SC[C@@H](O)[C@H]3O)c2n1
: