Target
Muscarinic acetylcholine receptor M3
Ligand
BDBM50297135
Substrate
Meas. Tech.
ChEMBL_750511 (CHEMBL1786272)
IC50
839±n/a nM
Citation
 Lainé, DIWan, ZYan, HZhu, CXie, HFu, WBusch-Petersen, JNeipp, CDavis, RWiddowson, KLBlaney, FEFoley, JBacon, AMWebb, EFLuttmann, MABurman, MSarau, HMSalmon, MPalovich, MRBelmonte, K Design, synthesis, and structure-activity relationship of tropane muscarinic acetylcholine receptor antagonists. J Med Chem 52:5241-52 (2010)  
Target
Name:
Muscarinic acetylcholine receptor M3
Synonyms:
ACM3_HUMAN Cholinergic, muscarinic M3 Muscarinic receptor M3 | RecName: Full=Muscarinic acetylcholine receptor M3
Type:
Enzyme
Mol. Mass.:
66151.03
Organism:
Homo sapiens (Human)
Description:
P20309
Residue:
590
  
Inhibitor
Name:
BDBM50297135
Synonyms:
CHEMBL563305 | endo-N-benzyl-3-(8-methyl-8-azabicyclo[3.2.1]octan-3-yl)-2,2-diphenylpropanamide
Type:
Small organic molecule
Emp. Form.:
C30H34N2O
Mol. Mass.:
438.6038
SMILES:
CN1[C@@H]2CC[C@@H]1CC(CC(C(=O)NCc1ccccc1)(c1ccccc1)c1ccccc1)C2
: