Target
Muscarinic acetylcholine receptor M3
Ligand
BDBM50345680
Substrate
Meas. Tech.
ChEMBL_750511 (CHEMBL1786272)
IC50
>10000±n/a nM
Citation
 Lainé, DIWan, ZYan, HZhu, CXie, HFu, WBusch-Petersen, JNeipp, CDavis, RWiddowson, KLBlaney, FEFoley, JBacon, AMWebb, EFLuttmann, MABurman, MSarau, HMSalmon, MPalovich, MRBelmonte, K Design, synthesis, and structure-activity relationship of tropane muscarinic acetylcholine receptor antagonists. J Med Chem 52:5241-52 (2010)  
Target
Name:
Muscarinic acetylcholine receptor M3
Synonyms:
ACM3_HUMAN Cholinergic, muscarinic M3 Muscarinic receptor M3 | RecName: Full=Muscarinic acetylcholine receptor M3
Type:
Enzyme
Mol. Mass.:
66151.03
Organism:
Homo sapiens (Human)
Description:
P20309
Residue:
590
  
Inhibitor
Name:
BDBM50345680
Synonyms:
(3-endo)-3-{2-Hydroxy-2,2-bis[2-(methyloxy)phenyl]ethyl}-8,8-dimethyl-8-azoniabicyclo[3.2.1]octane Bromide | CHEMBL1782094
Type:
Small organic molecule
Emp. Form.:
C25H34NO3
Mol. Mass.:
396.5418
SMILES:
COc1ccccc1C(O)(CC1C[C@H]2CC[C@H](C1)[N+]2(C)C)c1ccccc1OC
: