Target
Hepatocyte growth factor receptor
Ligand
BDBM50347672
Substrate
Meas. Tech.
ChEMBL_755794 (CHEMBL1803461)
IC50
0.2±n/a nM
Citation
 Katz, JDJewell, JPGuerin, DJLim, JDinsmore, CJDeshmukh, SVPan, BSMarshall, CGLu, WAltman, MDDahlberg, WKDavis, LFalcone, DGabarda, AEHang, GHatch, HHolmes, RKunii, KLumb, KJLutterbach, BMathvink, RNazef, NPatel, SBQu, XReilly, JFRickert, KWRosenstein, CSoisson, SMSpencer, KBSzewczak, AAWalker, DWang, WYoung, JZeng, Q Discovery of a 5H-benzo[4,5]cyclohepta[1,2-b]pyridin-5-one (MK-2461) inhibitor of c-Met kinase for the treatment of cancer. J Med Chem 54:4092-108 (2011)  
Target
Name:
Hepatocyte growth factor receptor
Synonyms:
Hepatocyte growth factor receptor Hepatocyte growth factor receptor (c-MET) MET Met proto-oncogene (hepatocyte growth factor receptor) Tyrosine-protein kinase Met (c-Met) c-Met kinase
Type:
Protein
Mol. Mass.:
155559.73
Organism:
Homo sapiens (Human)
Description:
P08581
Residue:
1390
  
Inhibitor
Name:
BDBM50347672
Synonyms:
CHEMBL1802904
Type:
Small organic molecule
Emp. Form.:
C26H30N6O3S
Mol. Mass.:
506.62
SMILES:
CCN1CCC(CC1)n1cc(cn1)-c1cnc2ccc3ccc(NS(=O)(=O)N(C)C)cc3c(=O)c2c1
: