Target
Glucocorticoid receptor
Ligand
BDBM50348412
Substrate
Meas. Tech.
ChEMBL_754806 (CHEMBL1805661)
Ki
0.4±n/a nM
Citation
 Yang, BVWeinstein, DSDoweyko, LMGong, HVaccaro, WHuynh, TXiao, HYDoweyko, AMMcKay, LHolloway, DASomerville, JEHabte, SCunningham, MMcMahon, MTownsend, RShuster, DDodd, JHNadler, SGBarrish, JC Dimethyl-diphenyl-propanamide Derivatives As Nonsteroidal Dissociated Glucocorticoid Receptor Agonists. J Med Chem 53:8241-51 (2010)  
Target
Name:
Glucocorticoid receptor
Synonyms:
GCR_HUMAN GRL Glucocorticoid receptor (GRFP) Nuclear receptor subfamily 3 group C member 1
Type:
Enzyme
Mol. Mass.:
85656.87
Organism:
Homo sapiens (Human)
Description:
P04150
Residue:
777
  
Inhibitor
Name:
BDBM50348412
Synonyms:
CHEMBL1800982
Type:
Small organic molecule
Emp. Form.:
C19H18BrN3O2S
Mol. Mass.:
432.334
SMILES:
CC(C)([C@@H](c1ccccc1)c1ccc(O)c(Br)c1)C(=O)Nc1nncs1
: