Target
Tryptophan 2,3-dioxygenase
Ligand
BDBM21974
Substrate
Meas. Tech.
ChEMBL_761930 (CHEMBL1817449)
Ki
11500000±n/a nM
Citation
 Dolusic, ELarrieu, PMoineaux, LStroobant, VPilotte, LColau, DPochet, LVan den Eynde, BMasereel, BWouters, JFrédérick, R Tryptophan 2,3-dioxygenase (TDO) inhibitors. 3-(2-(pyridyl)ethenyl)indoles as potential anticancer immunomodulators. J Med Chem 54:5320-34 (2011)  
Target
Name:
Tryptophan 2,3-dioxygenase
Synonyms:
T23O_HUMAN TDO2 TRPO Tryptophan oxygenase Tryptophanase
Type:
PROTEIN
Mol. Mass.:
47874.48
Organism:
Homo sapiens (Human)
Description:
ChEMBL_825691
Residue:
406
  
Inhibitor
Name:
BDBM21974
Synonyms:
(2S)-2-amino-3-(1H-indol-3-yl)propanoic acid L-tryptophan US9138393, L-Tryptophan | US9144538, L-Tryptophan
Type:
Amino Acid
Emp. Form.:
C11H12N2O2
Mol. Mass.:
204.2252
SMILES:
N[C@@H](Cc1c[nH]c2ccccc12)C(O)=O
: