Target
Solute carrier family 15 member 2
Ligand
BDBM50350464
Substrate
Meas. Tech.
ChEMBL_762551 (CHEMBL1817008)
Ki
430000±n/a nM
Citation
 Pedretti, ADe Luca, LMarconi, CRegazzoni, LAldini, GVistoli, G Fragmental modeling of hPepT2 and analysis of its binding features by docking studies and pharmacophore mapping. Bioorg Med Chem 19:4544-51 (2011)  
Target
Name:
Solute carrier family 15 member 2
Synonyms:
Kidney H(+)/peptide cotransporter PEPT2 S15A2_HUMAN | SLC15A2
Type:
PROTEIN
Mol. Mass.:
81795.62
Organism:
Homo sapiens (Human)
Description:
ChEMBL_762551
Residue:
729
  
Inhibitor
Name:
BDBM50350464
Synonyms:
AMOXICILLINE Amoxi-Tabs | Amoxicillin
Type:
Small organic molecule
Emp. Form.:
C16H19N3O5S
Mol. Mass.:
365.404
SMILES:
CC1(C)S[C@@H]2[C@H](NC(=O)[C@H](N)c3ccc(O)cc3)C(=O)N2[C@H]1C(O)=O
: