Target
Solute carrier family 15 member 2
Ligand
BDBM50350471
Substrate
Meas. Tech.
ChEMBL_762551 (CHEMBL1817008)
Ki
4300000±n/a nM
Citation
 Pedretti, ADe Luca, LMarconi, CRegazzoni, LAldini, GVistoli, G Fragmental modeling of hPepT2 and analysis of its binding features by docking studies and pharmacophore mapping. Bioorg Med Chem 19:4544-51 (2011)  
Target
Name:
Solute carrier family 15 member 2
Synonyms:
Kidney H(+)/peptide cotransporter PEPT2 S15A2_HUMAN | SLC15A2
Type:
PROTEIN
Mol. Mass.:
81795.62
Organism:
Homo sapiens (Human)
Description:
ChEMBL_762551
Residue:
729
  
Inhibitor
Name:
BDBM50350471
Synonyms:
CEFMETAZOLE
Type:
Small organic molecule
Emp. Form.:
C15H17N7O5S3
Mol. Mass.:
471.534
SMILES:
CO[C@]1(NC(=O)CSCC#N)[C@H]2SCC(CSc3nnnn3C)=C(N2C1=O)C(O)=O
: