Target
Lysosomal acid glucosylceramidase
Ligand
BDBM50379101
Substrate
Meas. Tech.
ChEMBL_809543 (CHEMBL2015460)
pH
7±n/a
IC50
1210±n/a nM
Comments
extracted
Citation
 Trapero, ALlebaria, A The myo-1,2-Diaminocyclitol Scaffold Defines Potent Glucocerebrosidase Activators and Promising Pharmacological Chaperones for Gaucher Disease. ACS Med Chem Lett 2:614-619 (2011)  
Target
Name:
Lysosomal acid glucosylceramidase
Synonyms:
Acid beta-glucosidase Beta-glucocerebrosidase D-glucosyl-N-acylsphingosine glucohydrolase GBA1 GC GLUC Glucosylceramidase (GBA) Glucosylceramidase precursor (Beta-glucocerebrosidase) (Acid beta-glucosidase) (D-glucosyl-N-acylsphingosine glucohydrolase) (Alglucerase) (Imiglucerase) beta-glucocerebrosidase (GCase)
Type:
Enzyme
Mol. Mass.:
59724.64
Organism:
Homo sapiens (Human)
Description:
The beta-Glu activity was measured with commercially available beta-glucocerebrosidase (Ceredase) as the enzyme source.
Residue:
536
  
Inhibitor
Name:
BDBM50379101
Synonyms:
CHEMBL2012656
Type:
Small organic molecule
Emp. Form.:
C25H48N2O5
Mol. Mass.:
456.659
SMILES:
CCCCCCCCCN1[C@H]2[C@H]([C@H](O)[C@@H](O)[C@H](O)[C@H]2O)N(CCCCCCCCC)C1=O
: