Target
Adenosine receptor A1
Ligand
BDBM50379107
Substrate
Meas. Tech.
ChEMBL_812530 (CHEMBL2014405)
Ki
0.8±n/a nM
Citation
 Tosh, DKPhan, KDeflorian, FWei, QGao, ZGJacobson, KA Truncated (N)-Methanocarba Nucleosides as A(1) Adenosine Receptor Agonists and Partial Agonists: Overcoming Lack of a Recognition Element. ACS Med Chem Lett 2:626-631 (2011)  
Target
Name:
Adenosine receptor A1
Synonyms:
AA1R_RAT ADENOSINE A1 high Adenosine A1 receptor (A1) Adenosine receptors A1 | Adora1
Type:
Protein
Mol. Mass.:
36704.13
Organism:
Rattus norvegicus (rat)
Description:
Residue:
326
  
Inhibitor
Name:
BDBM50379107
Synonyms:
CHEMBL2012686
Type:
Small organic molecule
Emp. Form.:
C18H22ClN5O2
Mol. Mass.:
375.853
SMILES:
O[C@@H]1[C@@H]2C[C@@H]2[C@H]([C@@H]1O)n1cnc2c(NC(C3CC3)C3CC3)nc(Cl)nc12
: