Target
Adenosine receptor A3
Ligand
BDBM50379113
Substrate
Meas. Tech.
ChEMBL_812527 (CHEMBL2014402)
Ki
83.2±n/a nM
Citation
 Tosh, DKPhan, KDeflorian, FWei, QGao, ZGJacobson, KA Truncated (N)-Methanocarba Nucleosides as A(1) Adenosine Receptor Agonists and Partial Agonists: Overcoming Lack of a Recognition Element. ACS Med Chem Lett 2:626-631 (2011)  
Target
Name:
Adenosine receptor A3
Synonyms:
A3 adenosine receptor (hA3) ADORA3 | Adenosine A3 receptor (A3AR)
Type:
G Protein-Coupled Receptor (GPCR)
Mol. Mass.:
36197.32
Organism:
Homo sapiens (Human)
Description:
P0DMS8
Residue:
318
  
Inhibitor
Name:
BDBM50379113
Synonyms:
CHEMBL2012692
Type:
Small organic molecule
Emp. Form.:
C19H18ClF2N5O3
Mol. Mass.:
437.828
SMILES:
COc1ccc(F)c(F)c1CNc1nc(Cl)nc2n(cnc12)[C@@H]1[C@H]2C[C@H]2[C@@H](O)[C@H]1O
: