Target
Adenosine receptor A2a
Ligand
BDBM50379111
Substrate
Meas. Tech.
ChEMBL_812525 (CHEMBL2014361)
Ki
3020±n/a nM
Citation
 Tosh, DKPhan, KDeflorian, FWei, QGao, ZGJacobson, KA Truncated (N)-Methanocarba Nucleosides as A(1) Adenosine Receptor Agonists and Partial Agonists: Overcoming Lack of a Recognition Element. ACS Med Chem Lett 2:626-631 (2011)  
Target
Name:
Adenosine receptor A2a
Synonyms:
A2A adenosine receptor (hA2A) ADENOSINE A2 ADORA2 Adenosine A2A receptor (A2AAR)
Type:
G Protein-Coupled Receptor (GPCR)
Mol. Mass.:
44716.46
Organism:
Homo sapiens (Human)
Description:
P29274
Residue:
412
  
Inhibitor
Name:
BDBM50379111
Synonyms:
CHEMBL2012674
Type:
Small organic molecule
Emp. Form.:
C15H18ClN5O2
Mol. Mass.:
335.789
SMILES:
O[C@@H]1[C@@H]2C[C@@H]2[C@H]([C@@H]1O)n1cnc2c(NC3CCC3)nc(Cl)nc12
: