Target
Adenosine receptor A1
Ligand
BDBM50379120
Substrate
Meas. Tech.
ChEMBL_812523 (CHEMBL2014359)
Ki
72.2±n/a nM
Citation
 Tosh, DKPhan, KDeflorian, FWei, QGao, ZGJacobson, KA Truncated (N)-Methanocarba Nucleosides as A(1) Adenosine Receptor Agonists and Partial Agonists: Overcoming Lack of a Recognition Element. ACS Med Chem Lett 2:626-631 (2011)  
Target
Name:
Adenosine receptor A1
Synonyms:
A1 adenosine receptor (hA1) AA1R_HUMAN ADORA1 Adenosine A1-receptor Adenosine receptor A1 (hA1) | Adenosine transporter (AdT)
Type:
G Protein-Coupled Receptor (GPCR)
Mol. Mass.:
36520.92
Organism:
Homo sapiens (Human)
Description:
P30542
Residue:
326
  
Inhibitor
Name:
BDBM50379120
Synonyms:
CHEMBL2012682
Type:
Small organic molecule
Emp. Form.:
C14H18ClN5O2
Mol. Mass.:
323.778
SMILES:
CC(C)Nc1nc(Cl)nc2n(cnc12)[C@@H]1[C@H]2C[C@H]2[C@@H](O)[C@H]1O
: