Target
Beta-secretase 1
Ligand
BDBM50379199
Substrate
Meas. Tech.
ChEMBL_811059 (CHEMBL2014639)
Kd
350000±n/a nM
Citation
 Jordan, JBPoppe, LXia, XCheng, ACSun, YMichelsen, KEastwood, HSchnier, PDNixey, TZhong, W Fragment based drug discovery: practical implementation based on¹¿F NMR spectroscopy. J Med Chem 55:678-87 (2012)  
Target
Name:
Beta-secretase 1
Synonyms:
ASP2 Aspartyl protease 2 BACE1 Beta-secretase (BACE) Beta-secretase 1 (BACE 1) Beta-secretase 1 (BACE1) Beta-site amyloid precursor protein cleaving enzyme 1 Memapsin-2 beta-Secretase (BACE-1) | beta-Secretase (BACE1)
Type:
Protein
Mol. Mass.:
55755.10
Organism:
Homo sapiens (Human)
Description:
P56817
Residue:
501
  
Inhibitor
Name:
BDBM50379199
Synonyms:
CHEMBL2011271
Type:
Small organic molecule
Emp. Form.:
C8H8ClFN2S
Mol. Mass.:
218.679
SMILES:
NC(=N)SCc1c(F)cccc1Cl
: