Target
Acetylcholinesterase
Ligand
BDBM50379268
Substrate
Meas. Tech.
ChEMBL_811251 (CHEMBL2015203)
Ki
1.5±n/a nM
Citation
 Galdeano, CViayna, ESola, IFormosa, XCamps, PBadia, AClos, MVRelat, JRatia, MBartolini, MMancini, FAndrisano, VSalmona, MMinguillón, CGonzález-Muñoz, GCRodríguez-Franco, MIBidon-Chanal, ALuque, FJMuñoz-Torrero, D Huprine-tacrine heterodimers as anti-amyloidogenic compounds of potential interest against Alzheimer's and prion diseases. J Med Chem 55:661-9 (2012)  
Target
Name:
Acetylcholinesterase
Synonyms:
ACES_HUMAN Acetylcholinesterase (AChE) | Acetylcholinesterase (human AChE)
Type:
Enzyme
Mol. Mass.:
67792.70
Organism:
Homo sapiens (Human)
Description:
P22303
Residue:
614
  
Inhibitor
Name:
BDBM50379268
Synonyms:
CHEMBL3216556
Type:
Small organic molecule
Emp. Form.:
C37H46Cl6N4
Mol. Mass.:
759.506
SMILES:
Cl.Cl.Cl.Cl.[H][C@]12Cc3nc4cc(Cl)ccc4c(NCCCCCCCNc4c5CCCCc5nc5cc(Cl)ccc45)c3[C@]([H])(CC(C)=C1)C2
: