Target
Acetylcholinesterase
Ligand
BDBM8987
Substrate
Meas. Tech.
ChEMBL_811246 (CHEMBL2015198)
IC50
13±n/a nM
Citation
 Galdeano, CViayna, ESola, IFormosa, XCamps, PBadia, AClos, MVRelat, JRatia, MBartolini, MMancini, FAndrisano, VSalmona, MMinguillón, CGonzález-Muñoz, GCRodríguez-Franco, MIBidon-Chanal, ALuque, FJMuñoz-Torrero, D Huprine-tacrine heterodimers as anti-amyloidogenic compounds of potential interest against Alzheimer's and prion diseases. J Med Chem 55:661-9 (2012)  
Target
Name:
Acetylcholinesterase
Synonyms:
ACES_HUMAN Acetylcholinesterase (AChE) | Acetylcholinesterase (human AChE)
Type:
Enzyme
Mol. Mass.:
67792.70
Organism:
Homo sapiens (Human)
Description:
P22303
Residue:
614
  
Inhibitor
Name:
BDBM8987
Synonyms:
6-chloro-1,2,3,4-tetrahydroacridin-9-amine 6-chlorotacrine.HCl Tacrine Analogue 4
Type:
Small organic molecule
Emp. Form.:
C13H13ClN2
Mol. Mass.:
232.709
SMILES:
Nc1c2CCCCc2nc2cc(Cl)ccc12
: