Target
Cholinesterase
Ligand
BDBM10590
Substrate
Meas. Tech.
ChEMBL_811247 (CHEMBL2015199)
IC50
51±n/a nM
Citation
 Galdeano, CViayna, ESola, IFormosa, XCamps, PBadia, AClos, MVRelat, JRatia, MBartolini, MMancini, FAndrisano, VSalmona, MMinguillón, CGonzález-Muñoz, GCRodríguez-Franco, MIBidon-Chanal, ALuque, FJMuñoz-Torrero, D Huprine-tacrine heterodimers as anti-amyloidogenic compounds of potential interest against Alzheimer's and prion diseases. J Med Chem 55:661-9 (2012)  
Target
Name:
Cholinesterase
Synonyms:
Acylcholine acylhydrolase Butyrylcholine esterase (BChE) Butyrylcholinesterase (BuChE) CHLE_HUMAN Cholinesterases Pseudocholinesterase
Type:
Homotetramer
Mol. Mass.:
68422.27
Organism:
Homo sapiens (Human)
Description:
P06276
Residue:
602
  
Inhibitor
Name:
BDBM10590
Synonyms:
3-Chloro-6,7,10,11-tetrahydro-9-methyl-12-{{3-{N-{3-[(6-chloro-1,2,3,4-tetrahydroacridin-9-yl)amino]propyl}-N-methylamino}propyl}amino}-7,11-methanocycloocta[b]quinoline trihydrochloride Huprine-Tacrine Heterodimer 18d | {3-[(6-chloro-1,2,3,4-tetrahydroacridin-9-yl)amino]propyl}[3-({7-chloro-15-methyl-10-azatetracyclo[11.3.1.0^{2,11}.0^{4,9}]heptadeca-2(11),3,5,7,9,14-hexaen-3-yl}amino)propyl]methylamine trihydrochloride
Type:
Small organic molecule
Emp. Form.:
C37H43Cl2N5
Mol. Mass.:
628.677
SMILES:
CN(CCCNc1c2CCCCc2nc2cc(Cl)ccc12)CCCNc1c2C3CC(Cc2nc2cc(Cl)ccc12)C=C(C)C3
: