Target
Cholinesterase
Ligand
BDBM50379271
Substrate
Meas. Tech.
ChEMBL_811247 (CHEMBL2015199)
IC50
139±n/a nM
Citation
 Galdeano, CViayna, ESola, IFormosa, XCamps, PBadia, AClos, MVRelat, JRatia, MBartolini, MMancini, FAndrisano, VSalmona, MMinguillón, CGonzález-Muñoz, GCRodríguez-Franco, MIBidon-Chanal, ALuque, FJMuñoz-Torrero, D Huprine-tacrine heterodimers as anti-amyloidogenic compounds of potential interest against Alzheimer's and prion diseases. J Med Chem 55:661-9 (2012)  
Target
Name:
Cholinesterase
Synonyms:
Acylcholine acylhydrolase Butyrylcholine esterase (BChE) Butyrylcholinesterase (BuChE) CHLE_HUMAN Cholinesterases Pseudocholinesterase
Type:
Homotetramer
Mol. Mass.:
68422.27
Organism:
Homo sapiens (Human)
Description:
P06276
Residue:
602
  
Inhibitor
Name:
BDBM50379271
Synonyms:
CHEMBL3217208
Type:
Small organic molecule
Emp. Form.:
C37H46Cl4N4
Mol. Mass.:
688.6
SMILES:
Cl.Cl.Cl.[H][C@@]12Cc3nc4cc(Cl)ccc4c(NCCCCCCCNc4c5CCCCc5nc5ccccc45)c3[C@@]([H])(CC(C)=C1)C2
: