Target
DNA polymerase kappa
Ligand
BDBM50379292
Substrate
Meas. Tech.
ChEMBL_811439 (CHEMBL2013697)
Ki
9850±n/a nM
Citation
 Myobatake, YTakeuchi, TKuramochi, KKuriyama, IIshido, THirano, KSugawara, FYoshida, HMizushina, Y Pinophilins A and B, inhibitors of mammalian A-, B-, and Y-family DNA polymerases and human cancer cell proliferation. J Nat Prod 75:135-41 (2012)  
Target
Name:
DNA polymerase kappa
Synonyms:
DINB1 POLK_HUMAN
Type:
PROTEIN
Mol. Mass.:
98825.18
Organism:
Homo sapiens (Human)
Description:
ChEMBL_1297316
Residue:
870
  
Inhibitor
Name:
BDBM50379292
Synonyms:
CHEMBL2011646
Type:
Small organic molecule
Emp. Form.:
C21H22O7
Mol. Mass.:
386.3952
SMILES:
C\C=C\C1=CC2=CC(=O)[C@@](C)(OC(=O)c3c(C)cc(O)cc3O)[C@@H](O)[C@@H]2CO1
: