Target
Leucine-rich repeat serine/threonine-protein kinase 2
Ligand
BDBM482158
Substrate
Meas. Tech.
ChEMBL_810205 (CHEMBL2015541)
IC50
7.8±n/a nM
Citation
 Zhang, JDeng, XChoi, HGAlessi, DRGray, NS Characterization of TAE684 as a potent LRRK2 kinase inhibitor. Bioorg Med Chem Lett 22:1864-9 (2012)  
Target
Name:
Leucine-rich repeat serine/threonine-protein kinase 2
Synonyms:
Dardarin LRRK2_HUMAN Leucine-rich repeat serine/threonine-protein kinase 2 PARK8
Type:
Protein
Mol. Mass.:
286113.20
Organism:
Homo sapiens (Human)
Description:
Q5S007
Residue:
2527
  
Inhibitor
Name:
BDBM482158
Synonyms:
BDBM50242742 | TAE684
Type:
Emp. Form.:
C30H40ClN7O3S
Mol. Mass.:
614.202
SMILES:
COc1cc(ccc1Nc1ncc(Cl)c(Nc2ccccc2S(=O)(=O)C(C)C)n1)N1CCC(CC1)N1CCN(C)CC1
: