Target
5-hydroxytryptamine receptor 2C
Ligand
BDBM50379800
Substrate
Meas. Tech.
ChEMBL_809692 (CHEMBL2016003)
Ki
1430±n/a nM
Citation
 Conway, RJValant, CChristopoulos, ARobertson, ADCapuano, BCrosby, IT Synthesis and SAR study of 4-arylpiperidines and 4-aryl-1,2,3,6-tetrahydropyridines as 5-HT2C agonists. Bioorg Med Chem Lett 22:2560-4 (2012)  
Target
Name:
5-hydroxytryptamine receptor 2C
Synonyms:
5-HT-2C 5-HT2C-INI 5-HTR2C 5-hydroxytryptamine receptor 2C (5-HT-2C) 5HT-1C HTR1C Serotonin (5-HT3) receptor Serotonin Receptor 2C
Type:
G Protein-Coupled Receptor (GPCR)
Mol. Mass.:
51836.79
Organism:
Homo sapiens (Human)
Description:
P28335
Residue:
458
  
Inhibitor
Name:
BDBM50379800
Synonyms:
CHEMBL2011556
Type:
Small organic molecule
Emp. Form.:
C11H15ClN
Mol. Mass.:
196.696
SMILES:
Clc1cccc(c1)C1CC[NH2+]CC1
: