Target
5-hydroxytryptamine receptor 2C
Ligand
BDBM50379815
Substrate
Meas. Tech.
ChEMBL_809690 (CHEMBL2016001)
Ki
1160±n/a nM
Citation
 Conway, RJValant, CChristopoulos, ARobertson, ADCapuano, BCrosby, IT Synthesis and SAR study of 4-arylpiperidines and 4-aryl-1,2,3,6-tetrahydropyridines as 5-HT2C agonists. Bioorg Med Chem Lett 22:2560-4 (2012)  
Target
Name:
5-hydroxytryptamine receptor 2C
Synonyms:
5-HT-2C 5-HT2C-INI 5-HTR2C 5-hydroxytryptamine receptor 2C (5-HT-2C) 5HT-1C HTR1C Serotonin (5-HT3) receptor Serotonin Receptor 2C
Type:
G Protein-Coupled Receptor (GPCR)
Mol. Mass.:
51836.79
Organism:
Homo sapiens (Human)
Description:
P28335
Residue:
458
  
Inhibitor
Name:
BDBM50379815
Synonyms:
CHEMBL2011560
Type:
Small organic molecule
Emp. Form.:
C13H19N
Mol. Mass.:
189.2967
SMILES:
Cc1cccc(C2CCNCC2)c1C
: