Target
Ketohexokinase
Ligand
BDBM50380278
Substrate
Meas. Tech.
ChEMBL_813546 (CHEMBL2019655)
IC50
270±n/a nM
Citation
 Maryanoff, BEMcComsey, DFYabut, SCLuci, DKJordan, ADMasucci, JAJones, WJAbad, MCGibbs, ACPetrounia, I Inhibitors of Ketohexokinase: Discovery of Pyrimidinopyrimidines with Specific Substitution that Complements the ATP-Binding Site. ACS Med Chem Lett 2:538-543 (2011)  
Target
Name:
Ketohexokinase
Synonyms:
Hepatic fructokinase KHK_HUMAN Ketohexokinase (KHK) | Ketohexokinase (KHK) Isoform C
Type:
Enzyme Catalytic Domain
Mol. Mass.:
32521.64
Organism:
Homo sapiens (Human)
Description:
Residue:
298
  
Inhibitor
Name:
BDBM50380278
Synonyms:
CHEMBL2017246
Type:
Small organic molecule
Emp. Form.:
C21H23N9S2
Mol. Mass.:
465.598
SMILES:
CSc1ccccc1Nc1nc(nc2c(NCc3nccs3)ncnc12)N1CCNCC1
: