Target
Ketohexokinase
Ligand
BDBM50380272
Substrate
Meas. Tech.
ChEMBL_813545 (CHEMBL2019654)
IC50
70±n/a nM
Citation
 Maryanoff, BEMcComsey, DFYabut, SCLuci, DKJordan, ADMasucci, JAJones, WJAbad, MCGibbs, ACPetrounia, I Inhibitors of Ketohexokinase: Discovery of Pyrimidinopyrimidines with Specific Substitution that Complements the ATP-Binding Site. ACS Med Chem Lett 2:538-543 (2011)  
Target
Name:
Ketohexokinase
Synonyms:
Hepatic fructokinase KHK_HUMAN Ketohexokinase (KHK) | Ketohexokinase (KHK) Isoform C
Type:
Enzyme Catalytic Domain
Mol. Mass.:
32521.64
Organism:
Homo sapiens (Human)
Description:
Residue:
298
  
Inhibitor
Name:
BDBM50380272
Synonyms:
CHEMBL2017239
Type:
Small organic molecule
Emp. Form.:
C23H30N8
Mol. Mass.:
418.5379
SMILES:
Cc1ccccc1Nc1nc(nc2c(NCC3CC3)ncnc12)N1CCC(CN)CC1
: