Target
Ketohexokinase
Ligand
BDBM50380285
Substrate
Meas. Tech.
ChEMBL_813545 (CHEMBL2019654)
IC50
130±n/a nM
Citation
 Maryanoff, BEMcComsey, DFYabut, SCLuci, DKJordan, ADMasucci, JAJones, WJAbad, MCGibbs, ACPetrounia, I Inhibitors of Ketohexokinase: Discovery of Pyrimidinopyrimidines with Specific Substitution that Complements the ATP-Binding Site. ACS Med Chem Lett 2:538-543 (2011)  
Target
Name:
Ketohexokinase
Synonyms:
Hepatic fructokinase KHK_HUMAN Ketohexokinase (KHK) | Ketohexokinase (KHK) Isoform C
Type:
Enzyme Catalytic Domain
Mol. Mass.:
32521.64
Organism:
Homo sapiens (Human)
Description:
Residue:
298
  
Inhibitor
Name:
BDBM50380285
Synonyms:
CHEMBL2017254
Type:
Small organic molecule
Emp. Form.:
C21H28N8S
Mol. Mass.:
424.566
SMILES:
CNCCN(C)c1nc(Nc2ccccc2SC)c2ncnc(NCC3CC3)c2n1
: