Target
RAC-alpha serine/threonine-protein kinase
Ligand
BDBM50380246
Substrate
Meas. Tech.
ChEMBL_813549 (CHEMBL2019658)
IC50
>40000±n/a nM
Citation
 Maryanoff, BEMcComsey, DFYabut, SCLuci, DKJordan, ADMasucci, JAJones, WJAbad, MCGibbs, ACPetrounia, I Inhibitors of Ketohexokinase: Discovery of Pyrimidinopyrimidines with Specific Substitution that Complements the ATP-Binding Site. ACS Med Chem Lett 2:538-543 (2011)  
Target
Name:
RAC-alpha serine/threonine-protein kinase
Synonyms:
AKT phosphorylation (p-AKT) AKT1/PPP1CA C-AKT PKB alpha Protein kinase B Protein kinase B (Akt 1) Protein kinase B alpha Proto-oncogene Akt (Akt1) Proto-oncogene c-Akt (AKT1) RAC-PK-alpha RAC-alpha serine/threonine-protein kinase (AKT1) | RAC-alpha serine/threonine-protein kinase (pAKT)
Type:
Enzyme
Mol. Mass.:
55681.25
Organism:
Homo sapiens (Human)
Description:
P31749
Residue:
480
  
Inhibitor
Name:
BDBM50380246
Synonyms:
CHEMBL2017214
Type:
Small organic molecule
Emp. Form.:
C21H26N8S
Mol. Mass.:
422.55
SMILES:
CSc1ccccc1Nc1nc(nc2c(NCC3CC3)ncnc12)N1CCNCC1
: