Target
Sigma non-opioid intracellular receptor 1
Ligand
BDBM50170654
Substrate
Meas. Tech.
ChEMBL_812735 (CHEMBL2019953)
Ki
0.011±n/a nM
Citation
 Laurini, ECol, VDMamolo, MGZampieri, DPosocco, PFermeglia, MVio, LPricl, S Homology Model and Docking-Based Virtual Screening for Ligands of the s1 Receptor. ACS Med Chem Lett 2:834-839 (2011)  
Target
Name:
Sigma non-opioid intracellular receptor 1
Synonyms:
Opioid receptor SGMR1_RAT Sigma non-opioid intracellular receptor 1 Sigma-1 | Sigmar1
Type:
Enzyme Catalytic Domain
Mol. Mass.:
25266.54
Organism:
RAT
Description:
Q9R0C9
Residue:
223
  
Inhibitor
Name:
BDBM50170654
Synonyms:
(+-)-cis-4-(3-(4-tert-butylphenyl)-2-methylpropyl)-2,6-dimethylmorpholine CHEMBL372700 cis-4-(3-(4-(1,1-dimethylethyl)phenyl)-2-methylpropyl)-2,6-dimethylmorpholine cis-fenpropimorph fenpropimorph cis-form | fenpropimorphe
Type:
Small organic molecule
Emp. Form.:
C20H33NO
Mol. Mass.:
303.4821
SMILES:
CC(CN1C[C@H](C)O[C@H](C)C1)Cc1ccc(cc1)C(C)(C)C
: