Target
Cytochrome P450 3A4
Ligand
BDBM50380672
Substrate
Meas. Tech.
ChEMBL_813216 (CHEMBL2020948)
IC50
3100±n/a nM
Citation
 Mirguet, OLamotte, YDonche, FToum, JGellibert, FBouillot, AGosmini, RNguyen, VLDelannée, DSeal, JBlandel, FBoullay, ABBoursier, EMartin, SBrusq, JMKrysa, GRiou, ATellier, RCostaz, AHuet, PDudit, YTrottet, LKirilovsky, JNicodeme, E From ApoA1 upregulation to BET family bromodomain inhibition: discovery of I-BET151. Bioorg Med Chem Lett 22:2963-7 (2012)  
Target
Name:
Cytochrome P450 3A4
Synonyms:
Albendazole monooxygenase CP3A4_HUMAN CYP3A4 CYPIIIA4 Cytochrome P450 3A4 (CYP3A4) Nifedipine oxidase Taurochenodeoxycholate 6-alpha-hydroxylase
Type:
Enzyme
Mol. Mass.:
57349.57
Organism:
Homo sapiens (Human)
Description:
Residue:
503
  
Inhibitor
Name:
BDBM50380672
Synonyms:
CHEMBL2017276
Type:
Small organic molecule
Emp. Form.:
C28H23N5O4
Mol. Mass.:
493.5133
SMILES:
COc1cc2c(Nc3ccccc3C(=O)c3ccccn3)c(cnc2cc1-c1c(C)noc1C)C(N)=O
: