Target
Mu-type opioid receptor
Ligand
BDBM50380906
Substrate
Meas. Tech.
ChEMBL_813970 (CHEMBL2020482)
Ki
0.097±n/a nM
Citation
 Watanabe, YKitazawa, SFujii, HNemoto, THirayama, SNagase, H Design and synthesis of novel opioid ligands with an azabicyclo[2.2.2]octane skeleton and their pharmacologies. Bioorg Med Chem Lett 22:2689-92 (2012)  
Target
Name:
Mu-type opioid receptor
Synonyms:
M-OR-1 Mor OPRM_MOUSE Oprm | Oprm1
Type:
Enzyme Catalytic Domain
Mol. Mass.:
44431.62
Organism:
MOUSE
Description:
OPIATE Mu OPRM1 MOUSE::P42866
Residue:
398
  
Inhibitor
Name:
BDBM50380906
Synonyms:
CHEMBL2016675
Type:
Small organic molecule
Emp. Form.:
C22H28N2O3
Mol. Mass.:
368.4693
SMILES:
CN1C[C@]2(O)CC[C@]11[C@H]3Cc4ccc(O)c5O[C@@H]2[C@]1(CCN3CC1CC1)c45
: