Target
Adenosine receptor A2a
Ligand
BDBM50382497
Substrate
Meas. Tech.
ChEMBL_816161 (CHEMBL2024727)
Ki
4.07±n/a nM
Citation
 Congreve, MAndrews, SPDoré, ASHollenstein, KHurrell, ELangmead, CJMason, JSNg, IWTehan, BZhukov, AWeir, MMarshall, FH Discovery of 1,2,4-triazine derivatives as adenosine A(2A) antagonists using structure based drug design. J Med Chem 55:1898-903 (2012)  
Target
Name:
Adenosine receptor A2a
Synonyms:
A2A adenosine receptor (hA2A) ADENOSINE A2 ADORA2 Adenosine A2A receptor (A2AAR)
Type:
G Protein-Coupled Receptor (GPCR)
Mol. Mass.:
44716.46
Organism:
Homo sapiens (Human)
Description:
P29274
Residue:
412
  
Inhibitor
Name:
BDBM50382497
Synonyms:
CHEMBL2021950 | US10988455, Example 1(xli)
Type:
Small organic molecule
Emp. Form.:
C17H16N4O
Mol. Mass.:
292.3351
SMILES:
Cc1cc(cc(C)c1O)-c1nnc(N)nc1-c1ccccc1
: