Target
Kinesin-like protein KIF11
Ligand
BDBM50382558
Substrate
Meas. Tech.
ChEMBL_816346 (CHEMBL2024744)
Ki
10.8±n/a nM
Citation
 Wang, FGood, JARath, OKaan, HYSutcliffe, OBMackay, SPKozielski, F Triphenylbutanamines: kinesin spindle protein inhibitors with in vivo antitumor activity. J Med Chem 55:1511-25 (2012)  
Target
Name:
Kinesin-like protein KIF11
Synonyms:
EG5 KIF11_HUMAN Kinesin Spindle Protein Eg5 TRIP5 | kinesin spindle protein
Type:
PROTEIN
Mol. Mass.:
119138.97
Organism:
Homo sapiens (Human)
Description:
ChEMBL_1457426
Residue:
1056
  
Inhibitor
Name:
BDBM50382558
Synonyms:
CHEMBL2022997
Type:
Small organic molecule
Emp. Form.:
C23H25N
Mol. Mass.:
315.4513
SMILES:
Cc1cccc(c1)C(CCCN)(c1ccccc1)c1ccccc1
: