Target
Kinesin-like protein KIF11
Ligand
BDBM50382582
Substrate
Meas. Tech.
ChEMBL_816346 (CHEMBL2024744)
Ki
9.8±n/a nM
Citation
 Wang, FGood, JARath, OKaan, HYSutcliffe, OBMackay, SPKozielski, F Triphenylbutanamines: kinesin spindle protein inhibitors with in vivo antitumor activity. J Med Chem 55:1511-25 (2012)  
Target
Name:
Kinesin-like protein KIF11
Synonyms:
EG5 KIF11_HUMAN Kinesin Spindle Protein Eg5 TRIP5 | kinesin spindle protein
Type:
PROTEIN
Mol. Mass.:
119138.97
Organism:
Homo sapiens (Human)
Description:
ChEMBL_1457426
Residue:
1056
  
Inhibitor
Name:
BDBM50382582
Synonyms:
CHEMBL2022999
Type:
Small organic molecule
Emp. Form.:
C24H25NO2
Mol. Mass.:
359.4608
SMILES:
Cc1ccc(cc1)C(CCC(N)C(O)=O)(c1ccccc1)c1ccccc1
: