Target
Kinesin-like protein KIF11
Ligand
BDBM50382560
Substrate
Meas. Tech.
ChEMBL_816346 (CHEMBL2024744)
Ki
9.7±n/a nM
Citation
 Wang, FGood, JARath, OKaan, HYSutcliffe, OBMackay, SPKozielski, F Triphenylbutanamines: kinesin spindle protein inhibitors with in vivo antitumor activity. J Med Chem 55:1511-25 (2012)  
Target
Name:
Kinesin-like protein KIF11
Synonyms:
EG5 KIF11_HUMAN Kinesin Spindle Protein Eg5 TRIP5 | kinesin spindle protein
Type:
PROTEIN
Mol. Mass.:
119138.97
Organism:
Homo sapiens (Human)
Description:
ChEMBL_1457426
Residue:
1056
  
Inhibitor
Name:
BDBM50382560
Synonyms:
CHEMBL2023002
Type:
Small organic molecule
Emp. Form.:
C23H25N
Mol. Mass.:
315.4513
SMILES:
Cc1ccc(cc1)C(CCCN)(c1ccccc1)c1ccccc1
: