Target
Carbonic anhydrase 12
Ligand
BDBM50382719
Substrate
Meas. Tech.
ChEMBL_817440 (CHEMBL2027663)
Ki
4.2±n/a nM
Citation
 Carta, FAggarwal, MMaresca, AScozzafava, AMcKenna, RMasini, ESupuran, CT Dithiocarbamates strongly inhibit carbonic anhydrases and show antiglaucoma action in vivo. J Med Chem 55:1721-30 (2012)  
Target
Name:
Carbonic anhydrase 12
Synonyms:
CA-XII CAH12_HUMAN Carbonic anhydrase Carbonic anhydrase XII Carbonic anhydrase XII (CAXII) | Tumor antigen HOM-RCC-3.1.3
Type:
Enzyme
Mol. Mass.:
39456.00
Organism:
Homo sapiens (Human)
Description:
Catalytic domain of human cloned isozyme was used in the assay
Residue:
354
  
Inhibitor
Name:
BDBM50382719
Synonyms:
CHEMBL2023724
Type:
Small organic molecule
Emp. Form.:
C5H10NO2S2
Mol. Mass.:
180.269
SMILES:
OCCN(CCO)C([S-])=S
: