Target
11-beta-hydroxysteroid dehydrogenase 1
Ligand
BDBM50382815
Substrate
Meas. Tech.
ChEMBL_815020 (CHEMBL2027041)
EC50
70±n/a nM
Citation
 Zhang, LChen, JNing, MZou, QLeng, YShen, J Synthesis and evaluation of piperidine urea derivatives as efficacious 11ß-hydroxysteroid dehydrogenase type 1 inhibitors in diabetic ob/ob mice. Bioorg Med Chem Lett 22:2748-52 (2012)  
Target
Name:
11-beta-hydroxysteroid dehydrogenase 1
Synonyms:
11-DH 11-beta-Hydroxysteroid Dehydrogenase 1 (11-beta-HSD1) 11-beta-hydroxysteroid dehydrogenase 1 (11HSD1) Corticosteroid 11-beta-dehydrogenase isozyme 1 (11-beta-HSD-1) Corticosteroid 11-beta-dehydrogenase isozyme 1 (11beta-HSD1) HSD11 HSD11L | SDR26C1
Type:
Enzyme
Mol. Mass.:
32409.16
Organism:
Homo sapiens (Human)
Description:
P28845
Residue:
292
  
Inhibitor
Name:
BDBM50382815
Synonyms:
CHEMBL2023426
Type:
Small organic molecule
Emp. Form.:
C26H28ClN3O4S
Mol. Mass.:
514.036
SMILES:
CN(C(=O)c1ccc(CN2C(=O)Nc3ccc(Cl)cc3S2(=O)=O)cc1)C12CC3CC(CC(C3)C1)C2
: