Target
Proto-oncogene tyrosine-protein kinase Src
Ligand
BDBM50383376
Substrate
Meas. Tech.
ChEMBL_818068 (CHEMBL2033710)
Ki
>10000±n/a nM
Citation
 Larson, ETOjo, KKMurphy, RCJohnson, SMZhang, ZKim, JELeibly, DJFox, AMReid, MCDale, EJPerera, BGKim, JHewitt, SNHol, WGVerlinde, CLFan, EVan Voorhis, WCMaly, DJMerritt, EA Multiple determinants for selective inhibition of apicomplexan calcium-dependent protein kinase CDPK1. J Med Chem 55:2803-10 (2012)  
Target
Name:
Proto-oncogene tyrosine-protein kinase Src
Synonyms:
Calmodulin/Proto-oncogene tyrosine-protein kinase Src Proto-oncogene c-Src SRC SRC_HUMAN V-src sarcoma (Schmidt-Ruppin A-2) viral oncogene homolog (avian) p60-Src | pp60c-src
Type:
Protein
Mol. Mass.:
59838.60
Organism:
Homo sapiens (Human)
Description:
P12931
Residue:
536
  
Inhibitor
Name:
BDBM50383376
Synonyms:
CHEMBL2030558 US10544104, Compound 144 | US9765037, Compound 144
Type:
Small organic molecule
Emp. Form.:
C19H24N6O
Mol. Mass.:
352.4335
SMILES:
COc1ccc(cc1C)-c1nn(CC2CCNCC2)c2ncnc(N)c12
: