Target
Tyrosine-protein kinase ABL1
Ligand
BDBM50383378
Substrate
Meas. Tech.
ChEMBL_818069 (CHEMBL2033711)
Ki
>10000±n/a nM
Citation
 Larson, ETOjo, KKMurphy, RCJohnson, SMZhang, ZKim, JELeibly, DJFox, AMReid, MCDale, EJPerera, BGKim, JHewitt, SNHol, WGVerlinde, CLFan, EVan Voorhis, WCMaly, DJMerritt, EA Multiple determinants for selective inhibition of apicomplexan calcium-dependent protein kinase CDPK1. J Med Chem 55:2803-10 (2012)  
Target
Name:
Tyrosine-protein kinase ABL1
Synonyms:
ABL ABL1_HUMAN JTK7 Proto-oncogene tyrosine-protein kinase ABL1 Tyrosine-protein kinase ABL V-abl Abelson murine leukemia viral oncogene homolog 1 p150 | tyrosine-protein kinase ABL1 isoform a
Type:
Enzyme
Mol. Mass.:
122897.30
Organism:
Homo sapiens (Human)
Description:
P00519
Residue:
1130
  
Inhibitor
Name:
BDBM50383378
Synonyms:
CHEMBL2030561
Type:
Small organic molecule
Emp. Form.:
C20H22N4O
Mol. Mass.:
334.4149
SMILES:
Nc1nc2ccc(cc2n1CC1CCNCC1)C(=O)c1ccccc1
: