Target
Kappa-type opioid receptor
Ligand
BDBM50384059
Substrate
Meas. Tech.
ChEMBL_819786 (CHEMBL2034298)
EC50
0.2±n/a nM
Citation
 Roberts, LRBrady, KBrown, ADavey, DFeng, LHuang, HLiu, DMalet, LMcMurray, GPhelan, ASaunders, KBhat, A Kappa agonist CovX-Bodies. Bioorg Med Chem Lett 22:4173-8 (2012)  
Target
Name:
Kappa-type opioid receptor
Synonyms:
Kappa Opioid Receptor OPRK1 Opiate Kappa 1 | mu/kappa opioid receptor
Type:
G Protein-Coupled Receptor (GPCR)
Mol. Mass.:
42744.99
Organism:
Cavia porcellus (domestic guinea pig)
Description:
P41144
Residue:
380
  
Inhibitor
Name:
BDBM50384059
Synonyms:
CHEMBL2032452
Type:
Small organic molecule
Emp. Form.:
C67H88N14O12
Mol. Mass.:
1281.5022
SMILES:
CC(C)C[C@@H](NC(=O)[C@@H](Cc1ccccc1)NC(=O)[C@H](N)Cc1ccccc1)C(=O)N[C@H](CCCCN)C(=O)N1CCC(CC(=O)NCCOCCOCC(=O)NCC(=O)NCc2cn(nn2)-c2ccc(cc2)C(=O)Nc2ccc(CCC(=O)N3CCC3=O)cc2)CC1
: