Target
Sphingosine 1-phosphate receptor 1
Ligand
BDBM50384696
Substrate
Meas. Tech.
ChEMBL_820804 (CHEMBL2038509)
EC50
25±n/a nM
Citation
 Harrington, PECroghan, MDFotsch, CFrohn, MLanman, BAPennington, LDPickrell, AJReed, ABSham, KKTasker, AArnett, HAFiorino, MLee, MRMcElvain, MMorrison, HGXu, HXu, YZhang, XWong, MCee, VJ Optimization of a Potent, Orally Active S1P1 Agonist Containing a Quinolinone Core. ACS Med Chem Lett 3:74-78 (2012)  
Target
Name:
Sphingosine 1-phosphate receptor 1
Synonyms:
CHEDG1 Endothelial differentiation G-protein coupled receptor 1 S1P1 S1PR1_HUMAN Sphingosine 1-phosphate receptor Edg-1
Type:
Enzyme
Mol. Mass.:
42836.02
Organism:
Homo sapiens (Human)
Description:
P21453
Residue:
382
  
Inhibitor
Name:
BDBM50384696
Synonyms:
CHEMBL2037130
Type:
Small organic molecule
Emp. Form.:
C29H24F3N3O4
Mol. Mass.:
535.5138
SMILES:
Cn1cc(C(=O)Nc2ccc(-c3ccccc3)c(c2)C(F)(F)F)c(=O)c2ccc(CN3CC(C3)C(O)=O)cc12
: