Target
High affinity nerve growth factor receptor
Ligand
BDBM50384734
Substrate
Meas. Tech.
ChEMBL_820919 (CHEMBL2038860)
IC50
7±n/a nM
Citation
 Albaugh, PFan, YMi, YSun, FAdrian, FLi, NJia, YSarkisova, YKreusch, AHood, TLu, MLiu, GHuang, SLiu, ZLoren, JTuntland, TKaranewsky, DSSeidel, HMMolteni, V Discovery of GNF-5837, a Selective TRK Inhibitor with Efficacy in Rodent Cancer Tumor Models. ACS Med Chem Lett 3:140-145 (2012)  
Target
Name:
High affinity nerve growth factor receptor
Synonyms:
2.7.10.1 NTRK1 NTRK1_HUMAN Neurotrophic tyrosine kinase receptor type 1 Synonyms=MTC TRK1-transforming tyrosine kinase protein TRKA GN Tropomyosin alpha-3 chain/High affinity nerve growth factor receptor Tropomyosin-related kinase A (TrkA) Tyrosine kinase receptor (Trk) Tyrosine kinase receptor A (Trk A) Tyrosine kinase receptor A (TrkA) p140-TrkA
Type:
Mol. Mass.:
87498.18
Organism:
Homo sapiens (Human)
Description:
P04629
Residue:
796
  
Inhibitor
Name:
BDBM50384734
Synonyms:
CHEMBL2037211
Type:
Small organic molecule
Emp. Form.:
C32H29F3N6O2
Mol. Mass.:
586.6069
SMILES:
CN1CCN(CC1)c1cc(cc(c1)C(F)(F)F)C(=O)Nc1cccc(Nc2ccc3\C(=C\c4ccc[nH]4)C(=O)Nc3c2)c1
: