Target
Thyroid hormone receptor beta
Ligand
BDBM50385101
Substrate
Meas. Tech.
ChEMBL_821529 (CHEMBL2038197)
Ki
1.54±n/a nM
Citation
 Shiohara, HNakamura, TKikuchi, NOzawa, TNagano, RMatsuzawa, AOhnota, HMiyamoto, TIchikawa, KHashizume, K Discovery of novel indane derivatives as liver-selective thyroid hormone receptorß (TRß) agonists for the treatment of dyslipidemia. Bioorg Med Chem 20:3622-34 (2012)  
Target
Name:
Thyroid hormone receptor beta
Synonyms:
ERBA2 Nuclear receptor subfamily 1 group A member 2 THR1 c-erbA-2 | c-erbA-beta
Type:
Receptor
Mol. Mass.:
52793.62
Organism:
Homo sapiens (Human)
Description:
Recombinant hThR was obtained from nuclear extracts from SF9 cells infected with baculovirus vectors encoding for ThRbeta 1.
Residue:
461
  
Inhibitor
Name:
BDBM50385101
Synonyms:
CHEMBL2035876
Type:
Small organic molecule
Emp. Form.:
C18H16Cl3NO5
Mol. Mass.:
432.682
SMILES:
CC(C)c1cc(Oc2c(Cl)cc(NC(=O)CC(O)=O)c(Cl)c2Cl)ccc1O
: