Target
Thyroid hormone receptor alpha
Ligand
BDBM50385106
Substrate
Meas. Tech.
ChEMBL_821530 (CHEMBL2038198)
Ki
147±n/a nM
Citation
 Shiohara, HNakamura, TKikuchi, NOzawa, TNagano, RMatsuzawa, AOhnota, HMiyamoto, TIchikawa, KHashizume, K Discovery of novel indane derivatives as liver-selective thyroid hormone receptorß (TRß) agonists for the treatment of dyslipidemia. Bioorg Med Chem 20:3622-34 (2012)  
Target
Name:
Thyroid hormone receptor alpha
Synonyms:
C-erbA-alpha EAR7 NR1A1 THA_HUMAN THRA1 Thyroid Hormone Receptor (TR-alpha) Thyroid hormone receptor alpha c-erbA-1
Type:
Receptor
Mol. Mass.:
54818.00
Organism:
Homo sapiens (Human)
Description:
Recombinant hThR was obtained from nuclear extracts from SF9 cells infected with baculovirus vectors encoding for ThRalpha 1.
Residue:
490
  
Inhibitor
Name:
BDBM50385106
Synonyms:
CHEMBL2035875
Type:
Small organic molecule
Emp. Form.:
C20H23NO5
Mol. Mass.:
357.4003
SMILES:
CC(C)c1cc(Oc2c(C)cc(NC(=O)CC(O)=O)cc2C)ccc1O
: