Target
D-alanyl-D-alanine carboxypeptidase
Ligand
BDBM39809
Substrate
Meas. Tech.
ChEMBL_822544 (CHEMBL2039477)
Ki
125000±n/a nM
Citation
 Zervosen, ABouillez, AHerman, AAmoroso, AJoris, BSauvage, ECharlier, PLuxen, A Synthesis and evaluation of boronic acids as inhibitors of Penicillin Binding Proteins of classes A, B and C. Bioorg Med Chem 20:3915-24 (2012)  
Target
Name:
D-alanyl-D-alanine carboxypeptidase
Synonyms:
DAC_ACTSP | dac
Type:
PROTEIN
Mol. Mass.:
54928.46
Organism:
Actinomadura sp. (strain R39)
Description:
ChEMBL_822544
Residue:
538
  
Inhibitor
Name:
BDBM39809
Synonyms:
Acylglycineboronic acid, 6
Type:
Small organic molecule
Emp. Form.:
C9H12BNO3
Mol. Mass.:
193.007
SMILES:
OB(O)CNC(=O)Cc1ccccc1
: