Target
Calcitonin gene-related peptide type 1 receptor/Receptor activity-modifying protein 3
Ligand
BDBM50385309
Substrate
Meas. Tech.
ChEMBL_822728 (CHEMBL2040045)
Ki
590±n/a nM
Citation
 Bell, IMStump, CAGallicchio, SNStaas, DDZartman, CBMoore, ELSain, NUrban, MBruno, JGCalamari, AKemmerer, ALMosser, SDFandozzi, CWhite, RBZrada, MMSelnick, HGGraham, SLVacca, JPKane, SASalvatore, CA MK-8825: a potent and selective CGRP receptor antagonist with good oral activity in rats. Bioorg Med Chem Lett 22:3941-5 (2012)  
Target
Name:
Calcitonin gene-related peptide type 1 receptor/Receptor activity-modifying protein 3
Synonyms:
Adrenomedullin receptor, AM2; CALCRL/RAMP3
Type:
Mol. Mass.:
Description:
ASSAY_ID of ChEMBL is 822728
Components:
This complex has 2 components.
Component 1
Name:
Calcitonin gene-related peptide type 1 receptor
Synonyms:
Adrenomedullin receptor AM1; CALCRL/RAMP2 CALRL_HUMAN CGRP type 1 receptor mRNA Calcitonin gene-related peptide (CGRP) receptor Calcitonin receptor-like receptor Human CL receptor
Type:
Enzyme Catalytic Domain
Mol. Mass.:
52980.45
Organism:
Homo sapiens (Human)
Description:
Q16602
Residue:
461
  
Component 2
Name:
Receptor activity-modifying protein 3
Synonyms:
CRLR activity-modifying protein 3 RAMP3 | RAMP3_HUMAN
Type:
PROTEIN
Mol. Mass.:
16516.30
Organism:
Homo sapiens (Human)
Description:
EBI_104910
Residue:
148
  
Inhibitor
Name:
BDBM50385309
Synonyms:
CHEMBL2035983
Type:
Small organic molecule
Emp. Form.:
C31H30F2N6O3
Mol. Mass.:
572.6051
SMILES:
C[C@]1(CNC2(CCCC2)C(=O)N1CC(=O)Nc1cnc2C[C@]3(Cc2c1)C(=O)Nc1ncccc31)c1cc(F)cc(F)c1
: