Target
Muscarinic acetylcholine receptor M4
Ligand
BDBM50385673
Substrate
Meas. Tech.
ChEMBL_826081 (CHEMBL2045512)
Ki
2.63±n/a nM
Citation
 Del Bello, FBarocelli, EBertoni, SBonifazi, ACamalli, MCampi, GGiannella, MMatucci, RNesi, MPigini, MQuaglia, WPiergentili, A 1,4-dioxane, a suitable scaffold for the development of novel M3 muscarinic receptor antagonists. J Med Chem 55:1783-7 (2012)  
Target
Name:
Muscarinic acetylcholine receptor M4
Synonyms:
ACM4_HUMAN Cholinergic, muscarinic M4 Muscarinic acetylcholine receptor M2 and M4
Type:
Enzyme Catalytic Domain
Mol. Mass.:
53079.31
Organism:
Homo sapiens (Human)
Description:
Cholinergic, muscarinic M4 CHRM4 HUMAN M3::P08173
Residue:
479
  
Inhibitor
Name:
BDBM50385673
Synonyms:
CHEMBL2042406
Type:
Small organic molecule
Emp. Form.:
C20H26NO2
Mol. Mass.:
312.4254
SMILES:
C[N+](C)(C)C[C@@H]1COCC(O1)(c1ccccc1)c1ccccc1
: